{"text_format":"1","workbook":"xlsx","n_sheets":2,"sheets":["Расчет","Приложения"],"not_rendered":{"charts":0,"images":0,"macros":1,"external_links":0,"defined_names":3,"comments":0,"pivot_tables":0},"unopened":[],"bounds":{"document_bytes":16777216,"sheet_cells":100000,"rows_first":2000,"rows_last":500,"rows_between":2000,"halvings":0,"cell_chars":16384,"cell_head_chars":4096},"cells_cut":0,"cells_raw":0,"read":"whole","date_system":"1900"}

{"sheet":"Расчет","index":0,"n_rows":32,"n_cols":9,"rows_kept":32,"cut":false,"hidden":false,"merged":[[0,1,0,6],[0,8,0,12],[2,8,6,12],[7,8,10,12],[26,8,31,12],[11,8,25,12],[11,6,13,6]]}
[null,"Калькулятор по расчёту платы за технологическое присоединение                                                                                                     к элетрическим сетям ООО \"ЭНЕРГОМОДУЛЬ\"",null,null,null,null,null,null,"ВАЖНО! Разрешите выполнение макросов на данной странице."]
[null,"Заявленный уровень напряжения",null,null,null,"кВ"]
[null,null,null,null,null,null,null,null,"Выполненный расчет является ориентировочным, итоговый расчет будет произведен после подачи Вами заявки на ТП при подготовке договора об осуществлении технологического присоединения.  "]
[null,"Категория надежности",null,"III",null,"III, II, I"]
[]
[null,"Максимальная мощность",null,null,null,"кВт"]
[]
[null,"Материалы линии 1",null,"Нет",null,null,null,null,"Данный калькулятор рассчитан на потребителей услуг по технологическому присоединению с заявляемой максимальной мощностью до 8900 кВт и уровне напряжения менее 35 кВ."]
[]
[null,"Длина линии 1",null,null,null,"км"]
[]
[null,"Материалы линии 2",null,"Нет",null,null,"Указывается,если категория надежности выше III. Иначе параметры второй линии не участвуют в расчете.",null,"Плата за технологическое присоединение составляет 550 рублей при условии, что: присоединение осуществляется по одному источнику, расстояние по прямой от границ участка заявителя до объектов электросетевого хозяйства на уровне напряжения до 20 кВ менее 300 метров в городах и поселках городского типа и 500 метров в сельской местности; размер максимальной мощности не превышает 15 кВт включительно (с учетом ранее присоединенных в данной точке присоединения энергопринимающих устройств); технологическое присоединение объектов, отнесенных к третьей категории надежности (по одному источнику электроснабжения)."]
[]
[null,"Длина линии 2",null,null,null,"км"]
[]
[null,"Строительство ТП",null,"Нет"]
[]
[]
[]
[]
[]
[]
[]
[]
[]
[null,null,null,"По стандартизированным ставкам"]
[null,null,null,0,null,"без НДС",null,null,"В случае присоединения энергопринимающих устройств с заявляемой максимальной мощностью не менее 8900 кВт включительно и на уровне напряжения не ниже 35 кВ, расчёт осущетвляется по индивидуальному проекту в соответсвии с Методическими указаниями  по определению размера платы за технологическое присоединение к электрическим сетям» утверждёнными приказом Федеральной службы по тарифам от 11.09.2012 № 209-э/1.  "]
[null,null,null,{"$f":"D27*1.18","v":0},null,"с НДС"]
[]
[null,null,null,"По ставкам за единицу максимальной мощности"]
[null,null,null,0,null,"без НДС"]
[null,null,null,{"$f":"D31*1.18","v":0},null,"с НДС"]

{"sheet":"Приложения","index":1,"n_rows":53,"n_cols":15,"rows_kept":53,"cut":false,"hidden":true,"merged":[]}
[0.4,"Нет","I",null,null,"Напряжение","0,4 кВ","10 кВ"]
[10,"ЖБ опоры; СИП сечением до 25 кв. мм включительно НН (0,4 кВ и ниже)","II",null,null,"0,4 кВ","III","I"]
[null,"ЖБ опоры; СИП сечением от 25 до 50 кв. мм включительно НН (0,4 кВ и ниже)","III",null,null,"10 кВ",null,"II"]
[null,"ЖБ опоры; СИП сечением от 50 до 75 кв. мм включительно НН (0,4 кВ и ниже)",null,null,null,null,null,"III"]
[null,"ЖБ опоры; СИП сечением от 75 до 100 кв. мм включительно НН (0,4 кВ и ниже)"]
[null,"ЖБ опоры; СИП сечением от 100 до 200 кв. мм включительно НН (0,4 кВ и ниже)"]
[null,"ЖБ опоры; СИП сечением от 50 до 75 кв. мм включительно СН2 (20-1 кВ)"]
[null,"В траншеях; многожильные сечением от 50 до 100 кв. мм включительно СН2 (20-1 кВ), НН (0,4 кВ и ниже)"]
[null,"В траншеях; многожильные сечением от 100 до 200 кв. мм включительно СН2 (20-1 кВ), НН (0,4 кВ и ниже)"]
[null,"В траншеях; многожильные сечением свыше 200 кв. мм включительно СН2 (20-1 кВ), НН (0,4 кВ и ниже)"]
[]
[]
[]
[]
[]
[]
[]
[]
[]
[]
[]
[]
[]
["№ п/п","Приложение 1",null,null,null,"№ п/п","Приложение 2",null,null,null,"№ п/п","Приложение 3"]
["С1",null,15493.93,null,null,"С1",null,null,null,null,"С1",476.84]
[null,"Нет",0,null,null,null,null,null,null,null,null,0]
["C21","ЖБ опоры; СИП сечением до 25 кв. мм включительно НН (0,4 кВ и ниже)",671705.14,null,{"$f":"VLOOKUP(Расчет!D8,Приложения!B26:C40,2,FALSE)","v":0},"C21",null,null,null,null,"C21",3524.14,null,null,{"$f":"VLOOKUP(Расчет!D8,Приложения!B26:L40,11,FALSE)","v":0}]
["C22","ЖБ опоры; СИП сечением от 25 до 50 кв. мм включительно НН (0,4 кВ и ниже)",889821.65,null,null,"C22",null,null,null,null,"C22",4065.65]
["C23","ЖБ опоры; СИП сечением от 50 до 75 кв. мм включительно НН (0,4 кВ и ниже)",874267.17,null,null,"C23",null,null,null,null,"C23",5429.23]
["C24","ЖБ опоры; СИП сечением от 75 до 100 кв. мм включительно НН (0,4 кВ и ниже)",756732.93,null,null,"C24",null,null,null,null,"C24",5615.16]
["C25","ЖБ опоры; СИП сечением от 100 до 200 кв. мм включительно НН (0,4 кВ и ниже)",1270011.49,null,null,"C25",null,null,null,null,"C25",5291.71]
["С26","ЖБ опоры; СИП сечением от 50 до 75 кв. мм включительно СН2 (20-1 кВ)",2158666.16,null,null,"С26",null,null,null,null,"С26",2012.54]
[]
[]
[]
[]
[]
["С31","В траншеях; многожильные сечением от 50 до 100 кв. мм включительно СН2 (20-1 кВ), НН (0,4 кВ и ниже)",1690383.71,null,{"$f":"VLOOKUP(Расчет!D12,Приложения!B26:C40,2,FALSE)","v":0},"С31",null,null,null,null,"С31",2748.73,null,null,{"$f":"VLOOKUP(Расчет!D12,Приложения!B26:L40,11,FALSE)","v":0}]
["С32","В траншеях; многожильные сечением от 100 до 200 кв. мм включительно СН2 (20-1 кВ), НН (0,4 кВ и ниже)",2031305.22,null,null,"С32",null,null,null,null,"С32",2279.17]
["С33","В траншеях; многожильные сечением свыше 200 кв. мм включительно СН2 (20-1 кВ), НН (0,4 кВ и ниже)",3202492.66,null,null,"С33",null,null,null,null,"С33",4703.46]
[]
[]
[]
[]
[null,"Нет",0,null,null,null,null,null,null,null,null,0]
["С51","Однотрансформаторная подстанция (ТП), трансформаторная мощность до 25 кВА включительно",12692.02,null,{"$f":"VLOOKUP(Расчет!D16,Приложения!B45:C53,2,FALSE)","v":0},"С51",null,null,null,null,"С51",12692.02,null,null,{"$f":"VLOOKUP(Расчет!D16,Приложения!B45:L53,11,FALSE)","v":0}]
["С52","Однотрансформаторная подстанция (ТП), трансформаторная мощность от 25 до 100 кВА включительно",10427.94,null,null,"С52",null,null,null,null,"С52",10427.94]
["С53","Однотрансформаторная подстанция (ТП), трансформаторная мощность от 100 до 250 кВА включительно",4762.05,null,null,"С53",null,null,null,null,"С53",4762.05]
["С54","Однотрансформаторная подстанция (ТП), трансформаторная мощность от 250 до 500 кВА включительно",2997.52,null,null,"С54",null,null,null,null,"С54",2997.52]
["С55","Однотрансформаторная подстанция (ТП), трансформаторная мощность от 500 до 900 кВА включительно",1382.1,null,null,"С55",null,null,null,null,"С55",1382.1]
["С56","Двухтрансформаторная подстанция (ТП), трансформаторная мощность от 100 до 250 кВА включительно",5848.47,null,null,"С56",null,null,null,null,"С56",5848.47]
["С57","Двухтрансформаторная подстанция (ТП), трансформаторная мощность от 500 до 900 кВА включительно",6577.47,null,null,"С57",null,null,null,null,"С57",6577.47]
["С58","Двухтрансформаторная подстанция (ТП), трансформаторная мощность свыше 1000 кВА включительно",4890.8,null,null,"С58",null,null,null,null,"С58",4890.8]